{"text_format":"1","workbook":"xlsx","n_sheets":17,"sheets":["Taches AF","Résumé","Personnel Detail","Bilan","Compte Budget AEP","Compte Subv ASC","Grand Livre","Banques","OD","Ventes","Achats","Caisse","Plan","Echéancier","NOMS","CALCUL divers","Programme"],"not_rendered":{"charts":0,"images":1,"macros":1,"external_links":0,"defined_names":4,"comments":1,"pivot_tables":3},"unopened":[],"bounds":{"document_bytes":16777216,"sheet_cells":100000,"rows_first":2000,"rows_last":500,"rows_between":2000,"halvings":0,"cell_chars":16384,"cell_head_chars":4096},"cells_cut":0,"cells_raw":0,"read":"whole","date_system":"1900"}

{"sheet":"Taches AF","index":0,"n_rows":0,"n_cols":0,"rows_kept":0,"cut":false,"hidden":true,"merged":[]}

{"sheet":"Résumé","index":1,"n_rows":29,"n_cols":3,"rows_kept":29,"cut":false,"hidden":false,"merged":[]}
["Mise à jour le :","2023-12-29"]
[]
[]
["Compte Subvention ASC à date :",{"$f":"GETPIVOTDATA(\"Diff\",Bilan!$B$3,\"C\",5,\"Compte\",512100)","v":25826.660000000011}]
[]
["Compte Fonctionnement à date :",{"$f":"GETPIVOTDATA(\"Diff\",Bilan!$B$3,\"C\",5,\"Compte\",512101)","v":19292.66}]
[]
["Virement ASC 2023 NESTLE envr",null,18453]
[]
[]
[]
[]
["Budget par personne 2023",2000]
["Budget Prev 2023",{"$f":"GETPIVOTDATA(\"S Crédit\",Bilan!$B$3,\"C\",1)","v":53500}]
["Utilisé 2023 à date",{"$f":"GETPIVOTDATA(\"S Débit\",Bilan!$B$3,\"C\",1)","v":53454.039999999986}]
["Reste à payer 2023 / à reporter",{"$f":"B14-B15","v":45.960000000013679}]
[]
["Activités CSE prévu 2023 ASC :",4000]
[]
["Solde Prev fin 2023 ASC :",{"$f":"B4+B8-B16-B18","v":21780.699999999997}]
{"$rows_left_out":10}
{"sheet":"Personnel Detail","index":2,"n_rows":32,"n_cols":6,"rows_kept":32,"cut":false,"hidden":false,"merged":[]}
[]
[null,null,"NOMS","Budget","Dépenses","Reste AF"]
[null,null,"Amina ISCAYE",2000,2000,0]
[null,null,"ANAIS LERUS",2000,2000,0]
[null,null,"Carla MARMOLEJO",1000,1000,0]
[null,null,"Christelle CHOUAN",2000,2000,0]
[null,null,"Eddy LORBEL",2000,2000,0]
[null,null,"EDWIN SANDOT",2000,2000,0]
[null,null,"Emilie GUILLAUME",500,500,0]
[null,null,"Eric CHARTON",2000,1978.75,21.25]
[null,null,"Geraldine PINOS",2000,1986,14]
[null,null,"Grenelle Triveillot",2000,1996.25,3.75]
[null,null,"Guillaume SOULAS",2000,2000,0]
[null,null,"Guy RAMALINGON",1500,1500,0]
[null,null,"Johanne LONGRAIS",2000,2000,0]
[null,null,"Julien LALAIT",1500,1500,0]
[null,null,"Lydia THALMENSI",2000,2000,0]
[null,null,"Lydie RESON",2000,2000,0]
[null,null,"MAILINE FIDOL",1000,1000.0000000000001,0]
[null,null,"Ma-Ivah BENOIT",2000,2000,0]
{"$rows_left_out":13}
{"sheet":"Bilan","index":3,"n_rows":12,"n_cols":14,"rows_kept":12,"cut":false,"hidden":false,"merged":[]}
[null,null,null,null,null,null,null,null,null,null,"Noms","Eric CHARTON"]
[]
[null,"Étiquettes de lignes","S Débit","S Crédit","Diff",null,null,null,null,null,"Étiquettes de lignes","S Débit","S Crédit","Diff"]
[null,1,53454.039999999986,53500,-45.960000000013679,null,null,null,null,null,1,375,2000,-1625]
[null,4,53454.039999999986,53454.039999999986,0,null,null,null,null,null,4,375,375,0]
[null,5,100124.36,55005.039999999986,45119.320000000014,null,null,null,null,null,"Total général",750,2375,-1625]
[null,512100,79280.7,53454.039999999986,25826.660000000011]
[null,512101,20843.66,1551,19292.66]
[null,6,110121.04000000004,null,110121.04000000004]
[null,7,null,152027.40000000002,-152027.40000000002]
[null,"(vide)",null,null,0]
[null,"Total général",317153.48,313986.48,3167]

{"sheet":"Compte Budget AEP","index":4,"n_rows":128,"n_cols":10,"rows_kept":128,"cut":false,"hidden":false,"merged":[]}
["Date opérat.","F","C","Compte","Rèf","Libéllé","Débit","Crédit","Solde","*"]
["2023-01-01",null,null,null,null,"Relevé au 01/01/2023",null,15507.66,{"$f":"+H2","v":15507.66},"*"]
["2023-06-02",null,null,null,null,"Virement transfert 10% AEP -> ASC",1551,null,{"$f":"I2-G3+H3","v":13956.66},"*"]
["2023-12-05",null,null,null,null,"Subvention de fonctionnement reçue l’employeur",null,5336,19292.66,"*"]
[null,null,null,null,null,null,null,null,19292.66]
[null,null,null,null,null,null,null,null,19292.66]
[null,null,null,null,null,null,null,null,19292.66]
[null,null,null,null,null,null,null,null,19292.66]
[null,null,null,null,null,null,null,null,19292.66]
[null,null,null,null,null,null,null,null,19292.66]
[null,null,null,null,null,null,null,null,19292.66]
[null,null,null,null,null,null,null,null,19292.66]
[null,null,null,null,null,null,null,null,19292.66]
[null,null,null,null,null,null,null,null,19292.66]
[null,null,null,null,null,null,null,null,19292.66]
[null,null,null,null,null,null,null,null,19292.66]
[null,null,null,null,null,null,null,null,19292.66]
[null,null,null,null,null,null,null,null,19292.66]
[null,null,null,null,null,null,null,null,19292.66]
[null,null,null,null,null,null,null,null,19292.66]
{"$rows_left_out":109}
{"sheet":"Compte Subv ASC","index":5,"n_rows":126,"n_cols":12,"rows_kept":126,"cut":false,"hidden":false,"merged":[]}
["Date opérat.","F","C","Compte","Rèf","Libéllé","Débit","Crédit","Solde",null,"Justif","Justif Numérisé"]
["2023-01-01",null,null,null,null,"Relevé au 01/01/2023",null,59276.7,{"$f":"+H2","v":59276.7},"*"]
["2023-02-24",null,null,null,null,"VIREMENT EMIS           \nWEB CHATRON ERIC ASC 2023 ASC Sport et Loisirs \nASC 2023                           ",375,null,{"$f":"I2-G3+H3","v":58901.7},"*"]
["2023-03-03",null,null,null,null,"VIREMENT EMIS           \nWEB ANNEQUIN MAXIME CSE Antilles ASC VOYAGES 2023 \nCSE Antilles Guyane                ",1870.62,null,57031.079999999994,"*"]
["2023-03-03",null,null,null,null,"VIREMENT EMIS           \nWEB Oriane MAYOUTE CSE Antilles ASC VOYAGES 2023 \nCSE Antilles Guyane                ",993.82,null,56037.259999999995,"*"]
["2023-03-03",null,null,null,null,"VIREMENT EMIS           \nWEB GUILLAUME SOULAS CSE Antille ASC VOYAGES 2023 \nCSE Antilles Guyane                ",1060.6600000000001,null,54976.599999999991,"*"]
["2023-03-06",null,null,null,null,"VIREMENT EMIS           \nWEB OLIVIA LAPORAL CSE Antilles ASC Sport et Loisirs 2023 \nCSE Antilles Guyane                ",298.95,null,54677.649999999994,"*"]
["2023-03-06",null,null,null,null,"VIREMENT EMIS           \nWEB Oriane MAYOUTE CSE Antilles ASC Sport et Loisirs 2023 \nCSE Antilles Guyane                ",389.4,null,54288.249999999993,"*"]
["2023-03-06",null,null,null,null,"VIREMENT EMIS           \nWEB Muriel DE GENTIL CSE Antille ASC VOYAGES 2023 \nCSE Antilles Guyane                ",2000,null,52288.249999999993,"*"]
["2023-03-09",null,null,null,null,"VIREMENT EMIS           \nWEB OLIVIA LAPORAL CSE Antilles ASC Voyage 2023 \nCSE Antilles Guyane                ",1035.5,null,51252.749999999993,"*"]
["2023-03-10",null,null,null,null,"VIREMENT EMIS           \nWEB Yohan LASSALLE CSE Antilles ASC Voyage 2023 \nCSE Antilles Guyane                ",2000,null,49252.749999999993,"*"]
["2023-03-13",null,null,null,null," Virement Web Edwin Sandot Cse Antilles Gu\nCse Antilles GuyaneAsc Voyages 2023",902.35,null,48350.399999999994,"*"]
["2023-03-13",null,null,null,null,"Virement Web Edwin Sandot Cse Antilles Gu\nCse Antilles GuyaneAsc Voyages 2023",40,null,48310.399999999994,"*"]
["2023-03-21",null,null,null,null," Virement Web Edwin Sandot Cse Antilles Gu\nCse Antilles GuyaneAsc Voyages 2023",540,null,47770.399999999994,"*"]
["2023-03-24",null,null,null,null,"Virement Web Ma-ivah Benoit Cse Antilles\nCse Antilles GuyaneAsc Voyages 2023",1510.75,null,46259.649999999994,"*"]
["2023-03-27",null,null,null,null,"Virement Web Oriane Mayoute Cse Antilles\nCse Antilles GuyaneAsc Voyages 2023",472.34,null,45787.31,"*"]
["2023-04-28",null,null,null,null," Virement Web Pinos Geraldine Cse Antilles\nCse Antilles Guyane\nAsc Voyages 2023",748.76,null,45038.549999999996,"*"]
["2023-04-28",null,null,null,null,"Virement Web Pinos Geraldine Cse Antilles\nCse Antilles GuyaneAsc 2022 Voyage",1237.24,null,43801.31,"*"]
["2023-05-02",null,null,null,null,"VIREMENT EMIS           \nWEB GUILLAUME SOULAS CSE Antille ASC 2023 Voyage \nCSE Antilles Guyane",939.34,null,42861.97,"*"]
["2023-05-12",null,null,null,null,"VIREMENT EMIS           \nWEB Oriane MAYOUTE ASC 2023 Voya ASC 2023 Voyage                    CSE Antilles Guyane ",129,null,42732.97,"*"]
{"$rows_left_out":107}
{"sheet":"Grand Livre","index":6,"n_rows":753,"n_cols":11,"rows_kept":753,"cut":false,"hidden":false,"merged":[]}
["Date opérat.","F","C","Compte","Rèf","Libéllé","Débit","Crédit","Solde","Noms"]
["2023-01-01",null,5,512101,null,"Subvention de fonctionnement reçue l’employeur",15507.66,null,null,{"$f":"VLOOKUP(D2,NOMS!$A:$B,2,FALSE)","v":{"$error":"#N/A"}}]
["2023-01-01",null,7,756010,null,"Subvention de fonctionnement reçue l’employeur",null,15507.66,null,{"$f":"VLOOKUP(D3,NOMS!$A:$B,2,FALSE)","v":{"$error":"#N/A"}}]
["2023-01-01",null,5,512100,null,"Contribution ASC reçue de l’employeur",59276.7,null,null,{"$f":"VLOOKUP(D4,NOMS!$A:$B,2,FALSE)","v":{"$error":"#N/A"}}]
["2023-01-01",null,7,756020,null,"Contribution ASC reçue de l’employeur",null,59276.7,null,{"$f":"VLOOKUP(D5,NOMS!$A:$B,2,FALSE)","v":{"$error":"#N/A"}}]
["2023-01-01",null,6,681500,null,"Provision Budget ASC 2022",56667,null,null,{"$f":"VLOOKUP(D6,NOMS!$A:$B,2,FALSE)","v":{"$error":"#N/A"}}]
["2023-01-01",null,1,155001,"Budget ASC 2022","Provision Budget ASC 2022",null,2000,null,{"$f":"VLOOKUP(D7,NOMS!$A:$B,2,FALSE)","v":"Yohan LASSALLE"}]
["2023-01-01",null,1,155002,"Budget ASC 2022","Provision Budget ASC 2022",null,2000,null,{"$f":"VLOOKUP(D8,NOMS!$A:$B,2,FALSE)","v":"Eric CHARTON"}]
["2023-01-01",null,1,155003,"Budget ASC 2022","Provision Budget ASC 2022",null,2000,null,{"$f":"VLOOKUP(D9,NOMS!$A:$B,2,FALSE)","v":"Lydie RESON"}]
["2023-01-01",null,1,155004,"Budget ASC 2022","Provision Budget ASC 2022",null,2000,null,{"$f":"VLOOKUP(D10,NOMS!$A:$B,2,FALSE)","v":"Muriel DE GENTIL"}]
["2023-01-01",null,1,155005,"Budget ASC 2022","Provision Budget ASC 2022",null,2000,null,{"$f":"VLOOKUP(D11,NOMS!$A:$B,2,FALSE)","v":"Oriane Mayoute"}]
["2023-01-01",null,1,155006,"Budget ASC 2022","Provision Budget ASC 2022",null,2000,null,{"$f":"VLOOKUP(D12,NOMS!$A:$B,2,FALSE)","v":"Amina ISCAYE"}]
["2023-01-01",null,1,155007,"Budget ASC 2022","Provision Budget ASC 2022",null,2000,null,{"$f":"VLOOKUP(D13,NOMS!$A:$B,2,FALSE)","v":"Geraldine PINOS"}]
["2023-01-01",null,1,155008,"Budget ASC 2022","Provision Budget ASC 2022",null,2000,null,{"$f":"VLOOKUP(D14,NOMS!$A:$B,2,FALSE)","v":"Stephanie LUBIN"}]
["2023-01-01",null,1,155009,"Budget ASC 2022","Provision Budget ASC 2022",null,2000,null,{"$f":"VLOOKUP(D15,NOMS!$A:$B,2,FALSE)","v":"Eddy LORBEL"}]
["2023-01-01",null,1,155010,"Budget ASC 2022","Provision Budget ASC 2022",null,2000,null,{"$f":"VLOOKUP(D16,NOMS!$A:$B,2,FALSE)","v":"Olivia LAPORAL"}]
["2023-01-01",null,1,155011,"Budget ASC 2022","Provision Budget ASC 2022",null,2000,null,{"$f":"VLOOKUP(D17,NOMS!$A:$B,2,FALSE)","v":"Ma-Ivah BENOIT"}]
["2023-01-01",null,1,155012,"Budget ASC 2022","Provision Budget ASC 2022",null,2000,null,{"$f":"VLOOKUP(D18,NOMS!$A:$B,2,FALSE)","v":"Lydia THALMENSI"}]
["2023-01-01",null,1,155013,"Budget ASC 2022","Provision Budget ASC 2022",null,2000,null,{"$f":"VLOOKUP(D19,NOMS!$A:$B,2,FALSE)","v":"Christelle CHOUAN"}]
["2023-01-01",null,1,155015,"Budget ASC 2022","Provision Budget ASC 2022",null,2000,null,{"$f":"VLOOKUP(D20,NOMS!$A:$B,2,FALSE)","v":"Mireille ROCHE"}]
{"$rows_left_out":734}
{"sheet":"Banques","index":7,"n_rows":209,"n_cols":14,"rows_kept":209,"cut":false,"hidden":true,"merged":[]}
["Date opérat.",null,null,"Compte","Rèf","Credit Agricole ","Débit","Crédit"]
["2022-05-09",null,5,512101,null,"Subvention de fonctionnement reçue l’employeur",16141]
["2022-05-09",null,7,756010,null,"Subvention de fonctionnement reçue l’employeur",null,16141]
["2022-05-20",null,5,512100,null,"Subvention de fonctionnement reçue l’employeur",94278]
["2022-05-20",null,7,756020,null,"Contribution ASC reçue de l’employeur",null,94278]
["2022-07-01",null,4,421001,"Remb Avance","Remboursement YL Achat Dictaphonne DIGITAL",150]
["2022-07-01",null,5,512101,null,"Remboursement YL Achat Dictaphonne DIGITAL",null,150]
["2022-06-13",null,4,421006,"voyage","ASC Amina ISCAYE",1500]
["2022-06-13",null,5,512100,null,"ASC Amina ISCAYE",null,1500]
["2022-06-13",null,4,421015,"voyage","ASC Mireille ROCHE",1500]
["2022-06-13",null,5,512100,null,"ASC Mireille ROCHE",null,1500]
["2022-06-13",null,4,421004,"voyage","ASC Muriel DE GENTIL",1500]
["2022-06-13",null,5,512100,null,"ASC Muriel DE GENTIL",null,1500]
["2022-06-13",null,4,421003,"voyage","ASC Lydie RESON",1500,null,null,"Adelmas NESLIDE"]
["2022-06-13",null,5,512100,null,"ASC Lydie RESON",null,1500]
["2022-06-16",null,4,421008,"voyage","ASC Stéphanie LUBIN",1500]
["2022-06-16",null,5,512100,null,"ASC Stéphanie LUBIN",null,1500]
["2022-06-17",null,4,421001,"voyage","ASC Yohan LASSALLE",1500]
["2022-06-17",null,5,512100,null,"ASC Yohan LASSALLE",null,1500]
["2022-08-04",null,4,421026,"voyage","ASC Adelmas NESLIDE",661.14]
{"$rows_left_out":190}
{"sheet":"OD","index":8,"n_rows":308,"n_cols":9,"rows_kept":308,"cut":false,"hidden":true,"merged":[]}
["2022-07-01",null,4,421001,null,"Achat Dictaphonne DIGITAL",null,150]
["2022-07-01",null,4,"401001",null,"Achat Dictaphonne DIGITAL",150]
["2022-06-13",null,6,647000,null,"ASC Amina ISCAYE",1500]
["2022-06-13",null,4,421006,null,"ASC Amina ISCAYE",null,1500," "]
["2022-06-13",null,1,155006,null,"Retour Provision Amina",1500]
["2022-06-13",null,7,787500,null,"Retour Provision Amina",null,1500]
["2022-05-20",null,6,681500,null,"Provision Budget ASC 2022",39000]
["2022-05-20",null,1,155001,null,"Provision Budget ASC 2022",null,1500]
["2022-05-20",null,1,155002,null,"Provision Budget ASC 2022",null,1500]
["2022-05-20",null,1,155003,null,"Provision Budget ASC 2022",null,1500]
["2022-05-20",null,1,155004,null,"Provision Budget ASC 2022",null,1500]
["2022-05-20",null,1,155005,null,"Provision Budget ASC 2022",null,0," "]
["2022-05-20",null,1,155006,null,"Provision Budget ASC 2022",null,1500]
["2022-05-20",null,1,155007,null,"Provision Budget ASC 2022",null,1500]
["2022-05-20",null,1,155008,null,"Provision Budget ASC 2022",null,1500]
["2022-05-20",null,1,155009,null,"Provision Budget ASC 2022",null,1500]
["2022-05-20",null,1,155010,null,"Provision Budget ASC 2022",null,1500]
["2022-05-20",null,1,155011,null,"Provision Budget ASC 2022",null,1500]
["2022-05-20",null,1,155012,null,"Provision Budget ASC 2022",null,1500]
["2022-05-20",null,1,155013,null,"Provision Budget ASC 2022",null,1500]
{"$rows_left_out":289}
{"sheet":"Ventes","index":9,"n_rows":26,"n_cols":23,"rows_kept":26,"cut":false,"hidden":true,"merged":[]}
[null,null,null,null,null,null,null,null,null,null,null,{"$f":"A1","v":"00:00:00"},null,{"$f":"C1","v":0},{"$f":"D1","v":0},{"$f":"E1","v":0},{"$f":"F1","v":0},null,{"$f":"G1","v":0}]
[null,null,null,null,null,null,null,null,null,null,null,{"$f":"L1","v":"00:00:00"},null,5,512100,{"$f":"P1","v":0},{"$f":"Q1","v":0},{"$f":"S1","v":0},null,null,150,null,{"$f":"U2","v":150}]
[null,null,null,null,null,null,null,null,null,null,null,null,null,null,null,null,null,null,null,null,null,{"$f":"U2-V4","v":120.6}]
[null,null,null,null,null,null,null,null,null,null,null,{"$f":"A4","v":"00:00:00"},null,{"$f":"C4","v":0},{"$f":"D4","v":0},{"$f":"E4","v":0},{"$f":"F4","v":0},null,{"$f":"G4","v":0},null,null,{"$f":"(U2/100)*19.6","v":29.400000000000002}]
[null,null,null,null,null,null,null,null,null,null,null,{"$f":"L4","v":"00:00:00"},null,5,512100,{"$f":"P4","v":0},{"$f":"Q4","v":0},{"$f":"S4","v":0}]
[]
[null,null,null,null,null,null,null,null,null,null,null,{"$f":"A7","v":"00:00:00"},null,{"$f":"C7","v":0},{"$f":"D7","v":0},{"$f":"E7","v":0},{"$f":"F7","v":0},null,{"$f":"G7","v":0}]
[null,null,null,null,null,null,null,null,null,null,null,{"$f":"L7","v":"00:00:00"},null,5,512100,{"$f":"P7","v":0},{"$f":"Q7","v":0},{"$f":"S7","v":0}]
[null,null,null,null,null,null,null,null,null," "]
[null,null,null,null,null,null,null,null,null,null,null,{"$f":"A10","v":"00:00:00"},null,{"$f":"C10","v":0},{"$f":"D10","v":0},{"$f":"E10","v":0},{"$f":"F10","v":0},null,{"$f":"G10","v":0}]
[null,null,null,null,null,null,null,null,null,null,null,{"$f":"L10","v":"00:00:00"},null,5,512100,{"$f":"P10","v":0},{"$f":"Q10","v":0},{"$f":"S10","v":0}]
[]
[null,null,null,null,null,null,null,null,null,null,null,{"$f":"A13","v":"00:00:00"},null,{"$f":"C13","v":0},{"$f":"D13","v":0},{"$f":"E13","v":0},{"$f":"F13","v":0},null,{"$f":"G13","v":0}]
[null,null,null,null,null,null,null,null,null,null,null,{"$f":"L13","v":"00:00:00"},null,5,512100,{"$f":"P13","v":0},{"$f":"Q13","v":0},{"$f":"S13","v":0}]
[]
[null,null,null,null,null,null,null,null,null,null,null,{"$f":"A16","v":"00:00:00"},null,{"$f":"C16","v":0},{"$f":"D16","v":0},{"$f":"E16","v":0},{"$f":"F16","v":0},null,{"$f":"G16","v":0}]
[null,null,null,null,null,null,null,null,null,null,null,{"$f":"L16","v":"00:00:00"},null,5,512100,{"$f":"P16","v":0},{"$f":"Q16","v":0},{"$f":"S16","v":0}]
[]
[null,null,null,null,null,null,null,null,null,null,null,{"$f":"A19","v":"00:00:00"},null,{"$f":"C19","v":0},{"$f":"D19","v":0},{"$f":"E19","v":0},{"$f":"F19","v":0},null,{"$f":"G19","v":0}]
[null,null,null,null,null,null,null,null,null,null,null,{"$f":"L19","v":"00:00:00"},null,5,512100,{"$f":"P19","v":0},{"$f":"Q19","v":0},{"$f":"S19","v":0}]
{"$rows_left_out":7}
{"sheet":"Achats","index":10,"n_rows":96,"n_cols":8,"rows_kept":96,"cut":false,"hidden":true,"merged":[]}
["Date opérat.","F","C","Compte","Rèf","Libéllé","Débit","Crédit"]
["2022-08-30",null,4,"401001",null,"Achat FourniBuro",null,103.94]
["2022-08-30",null,6,"606400",null,"Achat FourniBuro",103.94]
[]
[]
[]
[]
[]
[]
[]
[]
[]
[]
[]
[]
[]
[]
[]
[]
[]
{"$rows_left_out":77}
{"sheet":"Caisse","index":11,"n_rows":43,"n_cols":9,"rows_kept":43,"cut":false,"hidden":true,"merged":[]}
[null,null,null,null,null,null,null,null,{"$f":"+H1","v":0}]
[null,null,null,null,null,null,null,null,{"$f":"+I1-G2+H2","v":0}]
[null,null,null,null,null,null,null,null,{"$f":"+I2-G3+H3","v":0}]
[null,null,null,null,null,null,null,null,0]
[null,null,null,null,null,null,null,null,0]
[null,null,null,null,null,null,null,null,0]
[null,null,null,null,null,null,null,null,0]
[null,null,null,null,null,null,null,null,0]
[null,null,null,null,null,null,null,null,0]
[null,null,null,null,null,null,null,null,0]
[null,null,null,null,null,null,null,null,0]
[null,null,null,null,null,null,null,null,0]
[null,null,null,null,null,null,null,null,0]
[null,null,null,null,null,null,null,null,0]
[null,null,null,null,null,null,null,null,0]
[null,null,null,null,null,null,null,null,0]
[null,null,null,null,null,null,null,null,0]
[null,null,null,null,null,null,null,null,0]
[null,null,null,null,null,null,null,null,0]
[null,null,null,null,null,null,null,null,0]
{"$rows_left_out":24}
{"sheet":"Plan","index":12,"n_rows":72,"n_cols":10,"rows_kept":72,"cut":false,"hidden":false,"merged":[[0,0,0,3]]}
["PLAN COMPTABLE   CSE Antilles Guyane"]
[]
["N°","NOM","N°","NOM",null,null,null,"155 0xx provision ASC",null,"421 0xx salariés"]
[101000,"CAPITAL SOCIAL",null,null,"00","DIVERS ACHATS","01","Yohan LASSALLE","01","Yohan LASSALLE"]
[106100,"RESERVE LEGALE",606100,"Achats materiel","01","REPARATIONS","02","Eric CHARTON","02","Eric CHARTON"]
[106800,"AUTRES RESERVES",606300,"PETIT OUTILLAGE","02","AMENAGEMENTS","03","Lydie RESON","03","Lydie RESON"]
[110000,"REPORT A NOUVEAU",606400,"FOURNITURES DE BUREAU","03","PRESSING","04","Muriel DE GENTIL","04","Muriel DE GENTIL"]
[120000,"RESULTAT DE L'EXERCICE",607000,"Achat de Marchandise","04","TELEPHONE","05","Oriane Mayoute","05","Oriane Mayoute"]
[155000,"Provision pour ASC",603700,"Variation des stocks de marchandises","05","ELECTRICITE","06","Amina ISCAYE","06","Amina ISCAYE"]
[168000,"EMPRUNT YL.LASSALLE",615000,"ENTRETIEN","06","EAU","07","Geraldine PINOS","07","Geraldine"]
[null,null,615500,"CHARGES COLLECTIVES","07","IMPOTS","08","Stephanie LUBIN","08","Stephanie LUBIN"]
[211000,"TERRAIN",616000,"ASSURANCES","08","PUBLICITE","09","Eddy LORBEL","09","Eddy LORBEL"]
[213000,"CONSTRUCTION",618000,"DOCUMENTATION GENERALE","09","ENTRETIEN","10","Olivia LAPORAL","10","Olivia LAPORAL"]
[215000,"MATERIEL ET OUTILLAGE",622600,"HONORAIRES DIVERS","10","ASSURANCES","11","Ma-Ivah BENOIT","11","Ma-Ivah BENOIT"]
[218100,"AGENCEMENTS INSTALLATION",622700,"FRAIS ACTES ET CONTENTIEUX","11","JARDINAGE","12","Lydia THALMENSI","12","Lydia THALMENSI"]
[218200,"MATERIEL DE TRANSPORT",622800,"HONORAIRES DE GESTION","12","FRAIS BANCAIRE","13","Christelle CHOUAN","13","Christelle CHOUAN"]
[218300,"MATERIEL DE BUREAU",623000,"PUBLICITE","13"," RAYM/DEDE","14","Camille GUYOT","14","Camille GUYOT"]
[275000,"DEPOT DE GARANTIE PAYE",624000,"FRAIS DE VOITURE","20","INVESTISSEMENT","15","Mireille ROCHE","15","Mireille ROCHE"]
[281300,"AMORT. CONSTRUCTION",625000,"VOYAGE ET DEPLACEMENT",null,null,"16","Guy RAMALINGON","16","Guy RAMALINGON"]
[281810,"AMORT. AGENCEMENTS INSTALLAT.",625700,"MISSIONS RECEPTIONS",null,null,"17","RAISSA LUSINE","17","RAISSA LUSINE"]
{"$rows_left_out":53}
{"sheet":"Echéancier","index":13,"n_rows":0,"n_cols":0,"rows_kept":0,"cut":false,"hidden":true,"merged":[]}

{"sheet":"NOMS","index":14,"n_rows":66,"n_cols":10,"rows_kept":66,"cut":false,"hidden":false,"merged":[]}
[155001,"Yohan LASSALLE"]
[155002,"Eric CHARTON"]
[155003,"Lydie RESON"]
[155004,"Muriel DE GENTIL"]
[155005,"Oriane Mayoute"]
[155006,"Amina ISCAYE"]
[155007,"Geraldine PINOS"]
[155008,"Stephanie LUBIN"]
[155009,"Eddy LORBEL"]
[155010,"Olivia LAPORAL"]
[155011,"Ma-Ivah BENOIT"]
[155012,"Lydia THALMENSI"]
[155013,"Christelle CHOUAN"]
[155014,"Camille GUYOT","depart"]
[155015,"Mireille ROCHE"]
[155016,"Guy RAMALINGON",null,null,null,"2023-09-30"]
[155017,"RAISSA LUSINE","Arrivée dans l'entreprise le "]
[155018,"Xavier CORBIN"]
[155019,"Mylene MARTIN"]
[155020,"Johanne LONGRAIS"]
{"$rows_left_out":47}
{"sheet":"CALCUL divers","index":15,"n_rows":48,"n_cols":9,"rows_kept":48,"cut":false,"hidden":false,"merged":[]}
[]
[]
[]
[]
[]
[]
[]
[]
[]
[null,null,"Voiture de location",191,null,null,null,null,43.99]
[null,null,"Billet d'avion ",362.83,null,null,null,null,43.99]
[null,null,"Hôtel Beach view",400.53,null,null,null,null,43.99]
[null,null,"Hôtel South Gap",208.57,null,null,null,null,{"$f":"SUM(I10:I12)","v":131.97}]
[null,null,"Hôtel Sweetfield Manor",245.62]
[null,null,"Hôtel La Pagerie",202.4]
[null,null,"Facture Airbnb",216.67]
[null,null,"Facture la Ferme Attitude",150]
[null,null,null,{"$f":"SUM(D10:D17)","v":1977.62}]
[]
[]
{"$rows_left_out":29}
{"sheet":"Programme","index":16,"n_rows":32,"n_cols":7,"rows_kept":32,"cut":false,"hidden":false,"merged":[]}
["2023-12-29","\nVIREMENT EMIS MIREILLE ROCHE ASC 2023 Voyage",776,"Mireille ROCHE",{"$f":"VLOOKUP(D1,Plan!H4:I43,2,FALSE)","v":"15"},"Voyage","*"]
[]
[]
[]
[]
[null,null,null,"Retour Provision Eric CHARTON"]
[null,null,null,"Retour Provision Eric CHARTON"]
[null,null,null,"ASC Eric CHARTON"]
[null,null,null,"ASC Eric CHARTON"]
[null,null,null,"ASC Eric CHARTON"]
[null,null,null,"ASC Eric CHARTON"]
[]
[]
[]
[null,null,null,"Retour Provision Eric CHARTON"]
[null,null,null,"Retour Provision Eric CHARTON"]
[null,null,null,"ASC Eric CHARTON"]
[null,null,null,"ASC Eric CHARTON"]
[null,null,null,"ASC Eric CHARTON"]
[null,null,null,"ASC Eric CHARTON"]
{"$rows_left_out":12}